BDBM50200615 CHEMBL240941::N-isopropyl-2-(3-{1-[3-(5-methoxy-2-methylphenoxy)-4-methyl-pentyl]-piperidin-4-yl}-2-oxo-2,3-dihydro-benzimidazol-1-yl)-acetamide
SMILES COc1ccc(C)c(OC(CCN2CCC(CC2)n2c3ccccc3n(CC(=O)NC(C)C)c2=O)C(C)C)c1
InChI Key InChIKey=BHXTYLLOXRKFJS-UHFFFAOYSA-N
Data  2 KI  1 IC50
  Tab Delimited (TSV)   2D SDfile   Computed 3D by Vconf -m prep SDfile
Find this compound or compounds like it in BindingDB:
Activity Spreadsheet -- Enzyme Inhibition Constant Data from BindingDB
Found 2 hits for monomerid = 50200615
TargetNociceptin receptor(Homo sapiens (Human))
Organon Laboratories
Curated by ChEMBL
LigandPNGBDBM50200615(CHEMBL240941 | N-isopropyl-2-(3-{1-[3-(5-methoxy-2...)
Affinity DataKi:  20nM. Assay description: Displacement of [3H]nociceptin from human NOP receptor expressed in CHO cells
In DepthDetails ArticlePubMed
TargetNociceptin receptor(Homo sapiens (Human))
Organon Laboratories
Curated by ChEMBL
LigandPNGBDBM50200615(CHEMBL240941 | N-isopropyl-2-(3-{1-[3-(5-methoxy-2...)
Affinity DataIC50:  1.03E+3nM. Assay description: Agonist activity at human NOP receptor expressed in CHO cells assessed as inhibition of forskolin-stimulated cAMP production after 2 hrs
In DepthDetails ArticlePubMed